Home
last modified time | relevance | path

Searched defs:FAILED (Results 1 – 3 of 3) sorted by relevance

/test/developertest/src/core/driver/
Dparser.py28 FAILED = 1 variable in ResultCode
/test/xdevice/src/xdevice/_core/report/
Dsuite_reporter.py38 FAILED = 1 variable in ResultCode
/test/xts/acts/communication/wifi_p2p/src/main/js/default/test/
DWifiP2P.test.js294 FAILED : 2, property